{"text_format":"1","workbook":"xlsx","n_sheets":8,"sheets":["Orientación","Matriz","Listas","P-codes","Actividades","Hogares","Beneficiarios","Tendencias"],"not_rendered":{"charts":0,"images":1,"macros":0,"external_links":0,"defined_names":6,"comments":0,"pivot_tables":15},"unopened":[],"bounds":{"document_bytes":16777216,"sheet_cells":100000,"rows_first":2000,"rows_last":500,"rows_between":2000,"halvings":0,"cell_chars":16384,"cell_head_chars":4096},"cells_cut":0,"cells_raw":0,"read":"whole","date_system":"1900"}

{"sheet":"Orientación","index":0,"n_rows":42,"n_cols":5,"rows_kept":42,"cut":false,"hidden":false,"merged":[[21,1,22,1],[23,1,24,1],[38,1,41,1],[25,1,37,1],[3,1,3,4],[1,1,1,4],[0,1,0,4],[6,1,9,1],[10,1,15,1],[17,1,20,1]]}
[]
[null,"Sector de Alojamiento de El Salvador 5Ws: Orientación"]
[]
[null,"5W, de las 'w' del inglés Who is doing What, Where and When for Whom / Quién hace qué, dónde, cuándo y para quién) es una herramienta de coordinación diseñada para ayudar al Sector / Grupo de Alojamiento de El Salvador a recopilar y compartir información sobre las operaciones de los socios, así como a analizar y hacer un seguimiento de las actividades de los miembros del Grupo y del progreso del sector en su conjunto en el cumplimiento de los objetivos claves.\n\nEl 'Grupo Sectorial de Alojamiento' de El Salvador actualiza los datos regularmente (al menos entre una de sus reuniones y la siguiente). Se enviarán recordatorios individuales a las organizaciones del grupo conforme a esta regularidad para que cada socio envíe información sobre las actividades relacionadas con el alojamiento . Todos los datos recibidos se agregarán a la base de datos y se compartirán con todos los miembros del grupo. \n\nInstrucciones / REGLAS CLAVES para ACTUALIZAR los datos de la 5W:\n\n1.- Cada socio debe, SOLO, Y EXCLUSIVAMENTE, COMPLETAR LOS DATOS DE SU ORGANIZACIÓN EN LA PESTAÑA LLAMADA MATRIZ, y hacerlo considerando lo siguiente aquí abajo,\n2.- UNA línea de la matriz contendrá información sobre UNA distribución o prestación de servicios, correspondiente a UN tipo de actividad en UN municipio.\n\nSi una actividad se desarrolla en varios municipios, por favor, complete la información para cada municipio en líneas separadas.\nSi se informa de múltiples actividades para el mismo municipio, informe de cada actividad en una línea separada. \nEn ambos casos, por favor, complete todo con el mayor detalle posible,  con especial atención a la distribución de edad y sexo de las personas a las que es dirigida la actividad, y las personas que finalmente fueron beneficiadas con esta actividad.\nSi una actividad abarca varios meses, informe, añada sólo de la asistencia realizada desde el reistro anterior. ES MUY IMPORTANTE PARA CONTABILIZAR LOS TOTALES NO DUPLICAR DATOS, AÑADIENDO SOLO LOS NÚMERO NUEVOS DESDE LA ÚLTIMA INFORMACIÓN QUE SE DIÓ. Las columnas Z y AH nos ayudarán a comprobar si estamos dando los datos con coherencia entre totales y parciales.  \n\nSi tiene alguna pregunta después de leer, también, las instrucciones del cuadro aquí abajo, por favor, póngase en contacto con cualquier persona del equipo de coordinación del sector de Alojamiento de El Salvador (veánse detalles de contacto actualizados en la lista de contactos / Directorio)"]
[]
[null,"Categoría","Columna","Necesario?","Orientación"]
[null,"Metadatos","Fecha de reporte","SÍ","Introduzca la fecha de hoy en formato DD/MM/AAAA."]
[null,null,"Año de reporte","NO","Este campo sera completado automáticamente en función de los datos introducidos anteriormente."]
[null,null,"Mes de reporte","NO","Este campo sera completado automáticamente en función de los datos introducidos anteriormente."]
[null,null,"Día de reporte","NO","Este campo sera completado automáticamente en función de los datos introducidos anteriormente."]
[null,"QUIÉN","Organización lider","SÍ","Seleccione en la lista desplegable la organización que dirige este proyecto."]
[null,null,"Organización lider: Otra","NO","Rellene este campo sólo si la organización deseada no está en la lista desplegable."]
[null,null,"Organización implementadora","NO","Seleccione en la lista desplegable la organización que ejecuta este proyecto (si es diferente de la organización líder)."]
[null,null,"Organización implementadora: Otra","NO","Rellene este campo sólo si la organización deseada no está en la lista desplegable."]
[null,null,"Donante","SÍ","Seleccione en la lista desplegable el donante que financia este proyecto."]
{"$rows_left_out":28}
{"sheet":"Matriz","index":1,"n_rows":101,"n_cols":38,"rows_kept":101,"cut":false,"hidden":false,"merged":[]}
[null,null,null,null,null,null,"Sector de Alojamiento de El Salvador 5Ws"]
[]
["Metadatos",null,null,null,"QUIÉN",null,null,null,null,null,"Estatus","DÓNDE",null,null,null,"QUÉ",null,null,null,"CUANDO",null,"A QUIÉN",null,null,null,null,null,null,null,null,null,null,null,null,"Información adicional"]
[null,null,null,null,null,null,null,null,null,null,null,null,null,null,null,null,null,null,null,null,null,null,"Hogares",null,null,null,"Beneficiarios"]
["Fecha de reporte","Año de reporte","Mes de reporte","Día de reporte","Organización lider","Organización lider: Otra","Organización implementadora","Organización implementadora: Otra","Donante","Donante: Otra","Estatus de la actividad","Departamento (Admin 1)","Admin 1 p-code","Municipio (Admin 2)","Admin 2 p-code","Actividad sectorial","Actividad sectorial: Otra","Modalidad","Modalidad: Otra","Fecha de inicio de la actividad","Fecha prevista de finalización de la actividad","Actividad con personas asistidas recurrentes","Total de hogares asistidos en el periodo entre reportes","Total de hogares asistidos en el periodo entre reportes2","De este total son hogares desplazados","Verificación de total","Total de personas asistidas en el periodo entre reportes","De este total son niñas de 0 a 18 años","De este total son niños de 0 a 18 años","De este total son mujeres de 18 a 60 años","De este total son hombres de 18 a 60 años","De este total son mujeres de 60 años o mas","De este total son hombres de 60 años o mas","Verificación de total ","Comentarios","Nombre de la persona de contacto (suprimir antes de la publicación)","Número de teléfono de la persona de contacto (suprimir antes de la publicación)","Correo electrónico de la persona de contacto (suprimir antes de la publicación)"]
[null,{"$f":"IF($A6<>\"\",YEAR($A6),\"\")","v":""},{"$f":"IF($A6<>\"\",TEXT($A6,\"[$-es-SV]mmmm\"),\"\")","v":""},{"$f":"IF($A6<>\"\",DAY($A6),\"\")","v":""},null,{"$f":"IF(E6=\"Otra\",\"Escriba un nombre aquí\",IF(E6<>\"\",\"NA\",\"\"))","v":""},null,{"$f":"IF(G6=\"Otra\",\"Escriba un nombre aquí\",IF(G6<>\"\",\"NA\",\"\"))","v":""},null,{"$f":"IF(I6=\"Otra\",\"Escriba un nombre aquí\",IF(I6<>\"\",\"NA\",\"\"))","v":""},null,null,{"$f":"IFERROR(VLOOKUP(Table2[[#This Row],[Departamento (Admin 1)]],'P-codes'!$E$2:$F$15,2,FALSE),\"\")","v":""},null,{"$f":"IFERROR(VLOOKUP(Table2[[#This Row],[Municipio (Admin 2)]],'P-codes'!$C$2:$D$267,2,FALSE),\"\")","v":""},null,{"$f":"IF(P6=\"Otra\",\"Escriba un nombre aquí\",IF(P6<>\"\",\"NA\",\"\"))","v":""},null,{"$f":"IF(R6=\"Otra\",\"Escriba un nombre aquí\",IF(R6<>\"\",\"NA\",\"\"))","v":""},null,null,null,null,null,null,{"$f":"IF(SUM(Table2[[#This Row],[Total de hogares asistidos en el periodo entre reportes]],Table2[[#This Row],[Total de hogares asistidos en el periodo entre reportes2]:[De este total son hogares desplazados]])<>0,IF(SUM(Table2[[#This Row],[Total de hogares asistidos en el periodo entre reportes2]:[De este total son hogares desplazados]])=Table2[[#This Row],[Total de hogares asistidos en el periodo entre reportes]],0,1),\"\")","v":""},null,null,null,null,null,null,null,{"$f":"IF(SUM(Table2[[#This Row],[Total de personas asistidas en el periodo entre reportes]],Table2[[#This Row],[De este total son niñas de 0 a 18 años]:[De este total son hombres de 60 años o mas]])<>0,IF(SUM(Table2[[#This Row],[De este total son niñas de 0 a 18 años]:[De este total son hombres de 60 años o mas]])=Table2[[#This Row],[Total de personas asistidas en el periodo entre reportes]],0,1),\"\")","v":""},"-","-","-","-"]
[null,{"$f":"IF($A7<>\"\",YEAR($A7),\"\")","v":""},"","",null,"",null,"",null,"",null,null,{"$f":"IFERROR(VLOOKUP(Table2[[#This Row],[Departamento (Admin 1)]],'P-codes'!$E$2:$F$15,2,FALSE),\"\")","v":""},null,{"$f":"IFERROR(VLOOKUP(Table2[[#This Row],[Municipio (Admin 2)]],'P-codes'!$C$2:$D$267,2,FALSE),\"\")","v":""},null,"",null,"",null,null,null,null,null,null,{"$f":"IF(SUM(Table2[[#This Row],[Total de hogares asistidos en el periodo entre reportes]],Table2[[#This Row],[Total de hogares asistidos en el periodo entre reportes2]:[De este total son hogares desplazados]])<>0,IF(SUM(Table2[[#This Row],[Total de hogares asistidos en el periodo entre reportes2]:[De este total son hogares desplazados]])=Table2[[#This Row],[Total de hogares asistidos en el periodo entre reportes]],0,1),\"\")","v":""},null,null,null,null,null,null,null,{"$f":"IF(SUM(Table2[[#This Row],[Total de personas asistidas en el periodo entre reportes]],Table2[[#This Row],[De este total son niñas de 0 a 18 años]:[De este total son hombres de 60 años o mas]])<>0,IF(SUM(Table2[[#This Row],[De este total son niñas de 0 a 18 años]:[De este total son hombres de 60 años o mas]])=Table2[[#This Row],[Total de personas asistidas en el periodo entre reportes]],0,1),\"\")","v":""},"-","-","-","-"]
[null,"","","",null,"",null,"",null,"",null,null,{"$f":"IFERROR(VLOOKUP(Table2[[#This Row],[Departamento (Admin 1)]],'P-codes'!$E$2:$F$15,2,FALSE),\"\")","v":""},null,{"$f":"IFERROR(VLOOKUP(Table2[[#This Row],[Municipio (Admin 2)]],'P-codes'!$C$2:$D$267,2,FALSE),\"\")","v":""},null,"",null,"",null,null,null,null,null,null,{"$f":"IF(SUM(Table2[[#This Row],[Total de hogares asistidos en el periodo entre reportes]],Table2[[#This Row],[Total de hogares asistidos en el periodo entre reportes2]:[De este total son hogares desplazados]])<>0,IF(SUM(Table2[[#This Row],[Total de hogares asistidos en el periodo entre reportes2]:[De este total son hogares desplazados]])=Table2[[#This Row],[Total de hogares asistidos en el periodo entre reportes]],0,1),\"\")","v":""},null,null,null,null,null,null,null,{"$f":"IF(SUM(Table2[[#This Row],[Total de personas asistidas en el periodo entre reportes]],Table2[[#This Row],[De este total son niñas de 0 a 18 años]:[De este total son hombres de 60 años o mas]])<>0,IF(SUM(Table2[[#This Row],[De este total son niñas de 0 a 18 años]:[De este total son hombres de 60 años o mas]])=Table2[[#This Row],[Total de personas asistidas en el periodo entre reportes]],0,1),\"\")","v":""},"-","-","-","-"]
[null,"","","",null,"",null,"",null,"",null,null,{"$f":"IFERROR(VLOOKUP(Table2[[#This Row],[Departamento (Admin 1)]],'P-codes'!$E$2:$F$15,2,FALSE),\"\")","v":""},null,{"$f":"IFERROR(VLOOKUP(Table2[[#This Row],[Municipio (Admin 2)]],'P-codes'!$C$2:$D$267,2,FALSE),\"\")","v":""},null,"",null,"",null,null,null,null,null,null,{"$f":"IF(SUM(Table2[[#This Row],[Total de hogares asistidos en el periodo entre reportes]],Table2[[#This Row],[Total de hogares asistidos en el periodo entre reportes2]:[De este total son hogares desplazados]])<>0,IF(SUM(Table2[[#This Row],[Total de hogares asistidos en el periodo entre reportes2]:[De este total son hogares desplazados]])=Table2[[#This Row],[Total de hogares asistidos en el periodo entre reportes]],0,1),\"\")","v":""},null,null,null,null,null,null,null,{"$f":"IF(SUM(Table2[[#This Row],[Total de personas asistidas en el periodo entre reportes]],Table2[[#This Row],[De este total son niñas de 0 a 18 años]:[De este total son hombres de 60 años o mas]])<>0,IF(SUM(Table2[[#This Row],[De este total son niñas de 0 a 18 años]:[De este total son hombres de 60 años o mas]])=Table2[[#This Row],[Total de personas asistidas en el periodo entre reportes]],0,1),\"\")","v":""},"-","-","-","-"]
[null,"","","",null,"",null,"",null,"",null,null,{"$f":"IFERROR(VLOOKUP(Table2[[#This Row],[Departamento (Admin 1)]],'P-codes'!$E$2:$F$15,2,FALSE),\"\")","v":""},null,{"$f":"IFERROR(VLOOKUP(Table2[[#This Row],[Municipio (Admin 2)]],'P-codes'!$C$2:$D$267,2,FALSE),\"\")","v":""},null,"",null,"",null,null,null,null,null,null,{"$f":"IF(SUM(Table2[[#This Row],[Total de hogares asistidos en el periodo entre reportes]],Table2[[#This Row],[Total de hogares asistidos en el periodo entre reportes2]:[De este total son hogares desplazados]])<>0,IF(SUM(Table2[[#This Row],[Total de hogares asistidos en el periodo entre reportes2]:[De este total son hogares desplazados]])=Table2[[#This Row],[Total de hogares asistidos en el periodo entre reportes]],0,1),\"\")","v":""},null,null,null,null,null,null,null,{"$f":"IF(SUM(Table2[[#This Row],[Total de personas asistidas en el periodo entre reportes]],Table2[[#This Row],[De este total son niñas de 0 a 18 años]:[De este total son hombres de 60 años o mas]])<>0,IF(SUM(Table2[[#This Row],[De este total son niñas de 0 a 18 años]:[De este total son hombres de 60 años o mas]])=Table2[[#This Row],[Total de personas asistidas en el periodo entre reportes]],0,1),\"\")","v":""},"-","-","-","-"]
[null,"","","",null,"",null,"",null,"",null,null,{"$f":"IFERROR(VLOOKUP(Table2[[#This Row],[Departamento (Admin 1)]],'P-codes'!$E$2:$F$15,2,FALSE),\"\")","v":""},null,{"$f":"IFERROR(VLOOKUP(Table2[[#This Row],[Municipio (Admin 2)]],'P-codes'!$C$2:$D$267,2,FALSE),\"\")","v":""},null,"",null,"",null,null,null,null,null,null,{"$f":"IF(SUM(Table2[[#This Row],[Total de hogares asistidos en el periodo entre reportes]],Table2[[#This Row],[Total de hogares asistidos en el periodo entre reportes2]:[De este total son hogares desplazados]])<>0,IF(SUM(Table2[[#This Row],[Total de hogares asistidos en el periodo entre reportes2]:[De este total son hogares desplazados]])=Table2[[#This Row],[Total de hogares asistidos en el periodo entre reportes]],0,1),\"\")","v":""},null,null,null,null,null,null,null,{"$f":"IF(SUM(Table2[[#This Row],[Total de personas asistidas en el periodo entre reportes]],Table2[[#This Row],[De este total son niñas de 0 a 18 años]:[De este total son hombres de 60 años o mas]])<>0,IF(SUM(Table2[[#This Row],[De este total son niñas de 0 a 18 años]:[De este total son hombres de 60 años o mas]])=Table2[[#This Row],[Total de personas asistidas en el periodo entre reportes]],0,1),\"\")","v":""},"-","-","-","-"]
[null,"","","",null,"",null,"",null,"",null,null,{"$f":"IFERROR(VLOOKUP(Table2[[#This Row],[Departamento (Admin 1)]],'P-codes'!$E$2:$F$15,2,FALSE),\"\")","v":""},null,{"$f":"IFERROR(VLOOKUP(Table2[[#This Row],[Municipio (Admin 2)]],'P-codes'!$C$2:$D$267,2,FALSE),\"\")","v":""},null,"",null,"",null,null,null,null,null,null,{"$f":"IF(SUM(Table2[[#This Row],[Total de hogares asistidos en el periodo entre reportes]],Table2[[#This Row],[Total de hogares asistidos en el periodo entre reportes2]:[De este total son hogares desplazados]])<>0,IF(SUM(Table2[[#This Row],[Total de hogares asistidos en el periodo entre reportes2]:[De este total son hogares desplazados]])=Table2[[#This Row],[Total de hogares asistidos en el periodo entre reportes]],0,1),\"\")","v":""},null,null,null,null,null,null,null,{"$f":"IF(SUM(Table2[[#This Row],[Total de personas asistidas en el periodo entre reportes]],Table2[[#This Row],[De este total son niñas de 0 a 18 años]:[De este total son hombres de 60 años o mas]])<>0,IF(SUM(Table2[[#This Row],[De este total son niñas de 0 a 18 años]:[De este total son hombres de 60 años o mas]])=Table2[[#This Row],[Total de personas asistidas en el periodo entre reportes]],0,1),\"\")","v":""},"-","-","-","-"]
[null,"","","",null,"",null,"",null,"",null,null,{"$f":"IFERROR(VLOOKUP(Table2[[#This Row],[Departamento (Admin 1)]],'P-codes'!$E$2:$F$15,2,FALSE),\"\")","v":""},null,{"$f":"IFERROR(VLOOKUP(Table2[[#This Row],[Municipio (Admin 2)]],'P-codes'!$C$2:$D$267,2,FALSE),\"\")","v":""},null,"",null,"",null,null,null,null,null,null,{"$f":"IF(SUM(Table2[[#This Row],[Total de hogares asistidos en el periodo entre reportes]],Table2[[#This Row],[Total de hogares asistidos en el periodo entre reportes2]:[De este total son hogares desplazados]])<>0,IF(SUM(Table2[[#This Row],[Total de hogares asistidos en el periodo entre reportes2]:[De este total son hogares desplazados]])=Table2[[#This Row],[Total de hogares asistidos en el periodo entre reportes]],0,1),\"\")","v":""},null,null,null,null,null,null,null,{"$f":"IF(SUM(Table2[[#This Row],[Total de personas asistidas en el periodo entre reportes]],Table2[[#This Row],[De este total son niñas de 0 a 18 años]:[De este total son hombres de 60 años o mas]])<>0,IF(SUM(Table2[[#This Row],[De este total son niñas de 0 a 18 años]:[De este total son hombres de 60 años o mas]])=Table2[[#This Row],[Total de personas asistidas en el periodo entre reportes]],0,1),\"\")","v":""},"-","-","-","-"]
[null,"","","",null,"",null,"",null,"",null,null,{"$f":"IFERROR(VLOOKUP(Table2[[#This Row],[Departamento (Admin 1)]],'P-codes'!$E$2:$F$15,2,FALSE),\"\")","v":""},null,{"$f":"IFERROR(VLOOKUP(Table2[[#This Row],[Municipio (Admin 2)]],'P-codes'!$C$2:$D$267,2,FALSE),\"\")","v":""},null,"",null,"",null,null,null,null,null,null,{"$f":"IF(SUM(Table2[[#This Row],[Total de hogares asistidos en el periodo entre reportes]],Table2[[#This Row],[Total de hogares asistidos en el periodo entre reportes2]:[De este total son hogares desplazados]])<>0,IF(SUM(Table2[[#This Row],[Total de hogares asistidos en el periodo entre reportes2]:[De este total son hogares desplazados]])=Table2[[#This Row],[Total de hogares asistidos en el periodo entre reportes]],0,1),\"\")","v":""},null,null,null,null,null,null,null,{"$f":"IF(SUM(Table2[[#This Row],[Total de personas asistidas en el periodo entre reportes]],Table2[[#This Row],[De este total son niñas de 0 a 18 años]:[De este total son hombres de 60 años o mas]])<>0,IF(SUM(Table2[[#This Row],[De este total son niñas de 0 a 18 años]:[De este total son hombres de 60 años o mas]])=Table2[[#This Row],[Total de personas asistidas en el periodo entre reportes]],0,1),\"\")","v":""},"-","-","-","-"]
[null,"","","",null,"",null,"",null,"",null,null,{"$f":"IFERROR(VLOOKUP(Table2[[#This Row],[Departamento (Admin 1)]],'P-codes'!$E$2:$F$15,2,FALSE),\"\")","v":""},null,{"$f":"IFERROR(VLOOKUP(Table2[[#This Row],[Municipio (Admin 2)]],'P-codes'!$C$2:$D$267,2,FALSE),\"\")","v":""},null,"",null,"",null,null,null,null,null,null,{"$f":"IF(SUM(Table2[[#This Row],[Total de hogares asistidos en el periodo entre reportes]],Table2[[#This Row],[Total de hogares asistidos en el periodo entre reportes2]:[De este total son hogares desplazados]])<>0,IF(SUM(Table2[[#This Row],[Total de hogares asistidos en el periodo entre reportes2]:[De este total son hogares desplazados]])=Table2[[#This Row],[Total de hogares asistidos en el periodo entre reportes]],0,1),\"\")","v":""},null,null,null,null,null,null,null,{"$f":"IF(SUM(Table2[[#This Row],[Total de personas asistidas en el periodo entre reportes]],Table2[[#This Row],[De este total son niñas de 0 a 18 años]:[De este total son hombres de 60 años o mas]])<>0,IF(SUM(Table2[[#This Row],[De este total son niñas de 0 a 18 años]:[De este total son hombres de 60 años o mas]])=Table2[[#This Row],[Total de personas asistidas en el periodo entre reportes]],0,1),\"\")","v":""},"-","-","-","-"]
{"$rows_left_out":87}
{"sheet":"Listas","index":2,"n_rows":13,"n_cols":9,"rows_kept":13,"cut":false,"hidden":false,"merged":[]}
["Mes","Organización lider","Organización implementadora","Donante","Tipo de organización","Estatus","Actividad sectorial","Modalidad","Sí/No"]
["enero","ACNUR","X","A","Agencia de Naciones Unidas","Planificada","Alojamiento transitorio","Ayuda en especie","Sí"]
["febrero","Consejo Noruego para Refugiados","Y","B","Entidad del Gobierno","En curso","Reparación de viviendas","Transferencia de dinero efectivo (incondicional)","No"]
["marzo","Cruz Roja Salvadoreña","Z","C","ONG Internacional con oficina en El Salvador","Completada","Dinero en efectivo para el alquiler de viviendas provisorias","Transferencia de dinero efectivo (condicionado)"]
["abril","Dirección General de Protección Civil","Otra","Otra","Sociedad Nacional de la Cruz roja","Cancelada","NFIs (kits de construcción y domésticos)","Cupones"]
["mayo","FUNDASAL",null,null,null,"Duplicada","Refuerzo de las capacidades de preparación y respuesta de las organizaciones nacionales que trabajan en asuntos humanitarios ","Servicios"]
["junio","Habitat para la Humanidad El Salvador",null,null,null,null,"Otra","Asistencia de modalidad mixta"]
["julio","OIM",null,null,null,null,null,"Otra"]
["agosto","Save the Children"]
["septiembre","TECHO"]
["octubre","Otra"]
["noviembre"]
["diciembre"]

{"sheet":"P-codes","index":3,"n_rows":267,"n_cols":9,"rows_kept":267,"cut":false,"hidden":false,"merged":[]}
["Adm1_name","Adm1_pcode","Adm2_name","Adm2_pcode","Adm1_name","Adm1_pcode",null,null,""]
["Ahuachapán","SV01","Ahuachapán","SV0101","Ahuachapán","SV01"]
["Ahuachapán","SV01","Apaneca","SV0102","Cabañas","SV02"]
["Ahuachapán","SV01","Atiquizaya","SV0103","Chalatenango","SV03"]
["Ahuachapán","SV01","Concepción de Ataco","SV0104","Cuscatlán","SV04"]
["Ahuachapán","SV01","El Refugio","SV0105","La Libertad","SV05"]
["Ahuachapán","SV01","Guaymango","SV0106","La Paz","SV06"]
["Ahuachapán","SV01","Jujutla","SV0107","La Unión","SV07"]
["Ahuachapán","SV01","San Francisco Menéndez","SV0108","Morazán","SV08"]
["Ahuachapán","SV01","San Lorenzo","SV0109","San Miguel","SV09"]
["Ahuachapán","SV01","San Pedro Puxtla","SV0110","San Salvador","SV10"]
["Ahuachapán","SV01","Tacuba","SV0111","San Vicente","SV11"]
["Ahuachapán","SV01","Turín","SV0112","Santa Ana","SV12"]
["Cabañas","SV02","Cinquera","SV0201","Sonsonate","SV13"]
["Cabañas","SV02","Guacotecti","SV0202","Usulután","SV14"]
{"$rows_left_out":253}
{"sheet":"Actividades","index":4,"n_rows":60,"n_cols":6,"rows_kept":60,"cut":false,"hidden":false,"merged":[]}
["Estatus de la actividad","(All)",null,null,"Estatus de la actividad","(All)"]
["Fecha de inicio de la actividad","(All)",null,null,"Fecha de inicio de la actividad","(All)"]
["Departamento (Admin 1)","(All)",null,null,"Organización lider","(All)"]
["Municipio (Admin 2)","(All)",null,null,"Donante","(All)"]
["Organización lider","(All)"]
["Donante","(All)",null,null,"Row Labels","Count of Actividad sectorial"]
[null,null,null,null,"Ahuachapán",1]
["Row Labels","Count of Actividad sectorial",null,null,"San Francisco Menéndez",1]
["Otra",1,null,null,"Cabañas",2]
["(blank)",null,null,null,"Sensuntepeque",2]
["Alojamiento transitorio",4,null,null,"Chalatenango",1]
["Reparación de viviendas",4,null,null,"Concepción Quezaltepeque",1]
["Dinero en efectivo para el alquiler",4,null,null,"Cuscatlán",1]
["NFIs (kits de construcción y domésticos)",4,null,null,"San Cristóbal",1]
["Refuerzo de las capacidades de preparación y respuesta de las organizaciones nacionales que trabajan en asuntos humanitarios ",3,null,null,"La Libertad",1]
{"$rows_left_out":46}
{"sheet":"Hogares","index":5,"n_rows":107,"n_cols":4,"rows_kept":107,"cut":false,"hidden":false,"merged":[]}
["Estatus de la actividad","(All)"]
["Fecha de inicio de la actividad","(All)"]
["Departamento (Admin 1)","(All)"]
["Municipio (Admin 2)","(All)"]
["Organización lider","(All)"]
["Donante","(All)"]
[]
["Row Labels","Sum of Total de hogares asistidos en el mes","Sum of Hogares de la comunidad de acogida","Sum of Hogares desplazados"]
["Otra",600,300,300]
["(blank)"]
["Alojamiento transitorio",2400,1200,900]
["Reparación de viviendas",1800,1200,1200]
["Dinero en efectivo para el alquiler de viviendas provisorias",2400,1200,1200]
["NFIs (kits de construcción y domésticos)",2400,900,1200]
["Refuerzo de las capacidades de preparación y respuesta de las organizaciones nacionales que trabajan en asuntos humanitarios ",1200,900,900]
{"$rows_left_out":93}
{"sheet":"Beneficiarios","index":6,"n_rows":107,"n_cols":8,"rows_kept":107,"cut":false,"hidden":false,"merged":[]}
["Estatus de la actividad","(All)"]
["Fecha de inicio de la actividad","(All)"]
["Departamento (Admin 1)","(All)"]
["Municipio (Admin 2)","(All)"]
["Organización lider","(All)"]
["Donante","(All)"]
[]
["Row Labels","Sum of Total de personas asistidas en el mes","Sum of Niñas de 0 a 17 años","Sum of Niños de 0 a 17 años","Sum of Mujeres de 18 a 59 años","Sum of Hombres de 18 a 59 años","Sum of Mujeres de 60 años o mas","Sum of Hombres de 60 años o mas"]
["Otra",3600,600,600,600,600,600,600]
["(blank)"]
["Alojamiento transitorio",14400,2400,2400,2400,1800,2400,2400]
["Reparación de viviendas",14400,2400,1800,2400,2400,2400,2400]
["Dinero en efectivo para el alquiler de viviendas provisorias",10800,2400,2400,2400,2400,1800,2400]
["NFIs (kits de construcción y domésticos)",14400,2400,2400,1800,2400,2400,2400]
["Refuerzo de las capacidades de preparación y respuesta de las organizaciones nacionales que trabajan en asuntos humanitarios ",10800,1200,1800,1800,1800,1800,1200]
{"$rows_left_out":93}
{"sheet":"Tendencias","index":7,"n_rows":68,"n_cols":13,"rows_kept":68,"cut":false,"hidden":false,"merged":[]}
[]
["Estatus de la actividad","(All)"]
["Departamento (Admin 1)","(All)"]
["Municipio (Admin 2)","(All)"]
["Organización lider","(All)"]
["Donante","(All)"]
[]
["Count of Actividad sectorial","Column Labels"]
[null,"<01/01/2022","2022",null,null,null,null,null,null,"2022 Total","2024","2046","Grand Total"]
[null,null,"Qtr1",null,"Qtr1 Total","Qtr3","Qtr3 Total","Qtr4","Qtr4 Total"]
["Row Labels",null,"Jan","Feb",null,"Aug",null,"Dec"]
["Otra",null,null,null,null,null,null,null,null,null,null,1,1]
["(blank)"]
["Alojamiento transitorio",null,1,1,2,null,null,2,2,4,null,null,4]
["Reparación de viviendas",null,2,null,2,null,null,1,1,3,1,null,4]
{"$rows_left_out":53}